{"text_format":"1","workbook":"xlsx","n_sheets":6,"sheets":["登録内容","メンバー数","活動報告ｱﾝｹｰﾄ","学校名","加盟形態","エラーチェック"],"not_rendered":{"charts":0,"images":0,"macros":1,"external_links":0,"defined_names":1,"comments":2,"pivot_tables":0},"unopened":[],"bounds":{"document_bytes":16777216,"sheet_cells":100000,"rows_first":2000,"rows_last":500,"rows_between":2000,"halvings":0,"cell_chars":16384,"cell_head_chars":4096},"cells_cut":0,"cells_raw":0,"read":"whole","date_system":"1900"}

{"sheet":"登録内容","index":0,"n_rows":15,"n_cols":11,"rows_kept":15,"cut":false,"hidden":false,"merged":[[14,1,14,2],[14,3,14,4],[11,1,11,2],[12,1,12,2],[12,3,12,8],[11,3,11,8],[10,1,10,2],[8,1,8,2],[3,1,3,2],[3,3,3,8],[9,3,9,4],[9,5,9,8],[10,3,10,8],[4,3,4,8],[5,3,5,8],[6,1,6,2],[7,1,7,2],[6,3,6,8],[7,3,7,8],[6,10,6,21],[8,4,8,8],[1,1,1,8],[2,1,2,2],[4,1,4,2],[5,1,5,2],[2,3,2,8]]}
[]
[null,"令和8年度　青少年赤十字登録申込票"]
[null,"学校名",null,null,null,null,null,null,null,null,{"$f":"VLOOKUP($D3,学校名!$A:$C,2,FALSE)","v":{"$error":"#N/A"}}]
[null,"学校区分",null,{"$f":"VLOOKUP($D3,学校名!$A:$C,3,FALSE)","v":{"$error":"#N/A"}},null,null,null,null,null,null,{"$f":"VLOOKUP($D3,学校名!$A:$D,4,FALSE)","v":{"$error":"#N/A"}}]
[null,"電　話",null,null,null,null,null,null,null,null,"※ 半角数字（ハイフンなし）"]
[null,"F A X",null,null,null,null,null,null,null,null,"※ 半角数字（ハイフンなし）"]
[null,"代表メールアドレス",null,null,null,null,null,null,null,null,"※ こちらに入力いただいたメールアドレスあてに日本赤十字社からの文書等をお送りさせていただきます。\n　（メールでの文書受け取りについて対応不可の場合には別途ご連絡ください。）"]
[null,"担当教諭メールアドレス\n（任意）",null,null,null,null,null,null,null,null,"※ （任意）代表メールアドレスあてにお送りした内容と同じ内容をお送りします。"]
[null,"所在地",null,"〒",null,null,null,null,null,null,"※ 半角数字（ハイフンなし）"]
[null,null,null,null,null,null,null,null,null,null,"※ 住所は、左欄に「郡市町村」を、右欄に以降を記入してください。"]
[null,"学校長名"]
[null,"指導主任教諭"]
[null,"加盟形態",null,null,null,null,null,null,null,null,{"$f":"VLOOKUP(D13,加盟形態!$A:$B,2,FALSE)","v":{"$error":"#N/A"}}]
[]
[null,"登録申込日",null,null,null,null,null,null,null,null,"※メールを送信する日付を入力してください。（例　2023/00/00）"]

{"sheet":"メンバー数","index":1,"n_rows":26,"n_cols":17,"rows_kept":26,"cut":false,"hidden":false,"merged":[[2,0,6,8],[25,1,25,2],[25,5,25,6],[17,1,17,2],[17,5,17,6],[18,1,18,2],[21,1,21,2],[21,5,21,6],[19,1,19,2],[20,1,20,2],[18,5,18,6],[19,5,19,6],[24,1,24,2],[24,5,24,6],[23,1,23,2],[23,5,23,6],[20,5,20,6],[22,1,22,2],[22,5,22,6],[8,9,9,11],[8,12,8,15],[16,1,16,2],[16,5,16,6],[8,0,9,0],[10,1,10,2],[10,5,10,6],[10,9,10,11],[10,14,10,15],[8,16,9,16],[9,14,9,15],[14,1,14,2],[14,5,14,6],[15,1,15,2],[15,5,15,6],[11,1,11,2],[11,5,11,6],[12,1,12,2],[12,5,12,6],[13,1,13,2],[13,5,13,6],[8,1,9,2],[8,3,8,6],[8,7,9,7],[9,5,9,6]]}
["メンバー数"]
["該当の学校区分を確認し、指定の項目に入力をしてください。"]
["・小学校、幼稚園・保育所　→　小１～小６、特別支援学級\n・中学校　→　中１～中３、特別支援学級\n・義務教育学校　→　義務１～義務９、義務特別支援学級\n・高等学校　→　高１～高４\n・中等教育学校　→　中等１～中等６\n・特別支援学校　→　小１～高３"]
[]
[]
[]
[]
["※数が「０」の項目は、「０」を入力してください。"]
["学年","加盟学級数、又は委員会、部活数",null,"メンバー数",null,null,null,"指導者数",null,"全校学級数",null,null,"全校児童・生徒数",null,null,null,"全教員数"]
[null,null,null,"男","女","計",null,null,null,null,null,null,"男","女","計"]
["小1\n(義務1)",null,null,null,null,{"$f":"SUM(D11:E11)","v":0},null,null,null,null,null,null,null,null,{"$f":"SUM(M11:N11)","v":0}]
["小2\n(義務2)",null,null,null,null,{"$f":"SUM(D12:E12)","v":0}]
["小3\n(義務3)",null,null,null,null,{"$f":"SUM(D13:E13)","v":0}]
["小4\n(義務4)",null,null,null,null,0]
["小5\n(義務5)",null,null,null,null,0]
["小6\n(義務6)",null,null,null,null,0]
["特別支援学級",null,null,null,null,0]
["中1\n(義務7)(中等1)",null,null,null,null,{"$f":"SUM(D18:E18)","v":0}]
["中2\n(義務8)(中等2)",null,null,null,null,0]
["中3\n(義務9)(中等3)",null,null,null,null,0]
["特別支援学級\n（義務特別支援）",null,null,null,null,0]
["高1\n(中等4)",null,null,null,null,0]
["高2\n(中等5)",null,null,null,null,0]
["高3\n(中等6)",null,null,null,null,0]
["高4",null,null,null,null,{"$f":"SUM(B25:E25)","v":0}]
["合計",{"$f":"SUM(B11:C25)","v":0},null,{"$f":"SUM(D11:D25)","v":0},{"$f":"SUM(E11:E25)","v":0},{"$f":"SUM(F11:G25)","v":0},null,{"$f":"SUM(H11:H25)","v":0}]

{"sheet":"活動報告ｱﾝｹｰﾄ","index":2,"n_rows":49,"n_cols":9,"rows_kept":49,"cut":false,"hidden":false,"merged":[]}
[null,"活動内容アンケート"]
[null,"内容が該当する場合、□を■に変更してください。主な活動を21個まで選択可能です。"]
[null,"その他の活動に該当する場合は、■を選択して、その内容を空白欄に直接入力してください。"]
[]
[null,"　","「健康・安全」に関連した活動"]
[null,null,"□","救急法等講習会",null,null,null,"選択数",{"$f":"COUNTIF(C6:C49,\"■\")","v":0}]
[null,null,"□","あいさつ運動"]
[null,null,"□","保健衛生活動"]
[]
[null,null,"「奉仕」に関連した活動"]
[null,null,"□","地域内の清掃活動"]
[null,null,"□","高齢者との交流"]
[null,null,"□","病院・福祉施設訪問"]
[null,null,"□","花いっぱい運動"]
[null,null,"□","環境保護活動"]
[null,null,"□","福祉体験学習（手話、点字、車椅子等）"]
[null,null,"□","幼稚園・保育所訪問"]
[null,null,"□","心の友・障がい者支援運動"]
[]
[null,null,"「国際理解・親善」に関連した活動"]
[null,null,"□","海外メンバーとの交流"]
[null,null,"□","親善アルバム等の作成"]
[]
[null,null,"募金活動"]
[null,null,"□","一円玉募金（青少年赤十字海外支援事業）"]
[null,null,"□","赤十字活動資金"]
[null,null,"□","NHK海外たすけあい"]
[null,null,"□","義援金（国内）"]
[null,null,"□","救援金（海外）"]
[null,null,"□","その他の募金等（ユニセフ募金、赤い羽根募金、NHK歳末助け合い　他）"]
[]
[null,null,"物品等の収集活動"]
[null,null,"□","アルミ缶類、使用済み切手、エコキャップ、書き損じ葉書等の収集"]
[]
[null,null,"防災教育・その他の活動"]
[null,null,"□","防災教育プログラム「まもるいのち　ひろめるぼうさい」の活用"]
[null,null,"□","校内献血"]
[null,null,"□","ノーチャイム運動"]
[null,null,"□","献血推進活動"]
[null,null,"□","５分前行動"]
[]
[null,null,"研修会の実施、参加について"]
[null,null,"□","JRC登録式"]
[null,null,"□","県トレセン参加"]
[null,null,"□","地区トレセン参加"]
[null,null,"□","赤十字・青少年赤十字の学習"]
[]
[null,null,"その他の活動"]
[null,null,"□"]

{"sheet":"学校名","index":3,"n_rows":577,"n_cols":4,"rows_kept":577,"cut":false,"hidden":false,"merged":[]}
["前橋市立桃井小学校",1,"小学校",1]
["前橋市立中川小学校",2,"小学校",1]
["前橋市立敷島小学校",3,"小学校",1]
["前橋市立城南小学校",4,"小学校",1]
["前橋市立城東小学校",5,"小学校",1]
["前橋市立若宮小学校",6,"小学校",1]
["前橋市立天川小学校",7,"小学校",1]
["前橋市立岩神小学校",8,"小学校",1]
["前橋市立広瀬小学校",9,"小学校",1]
["前橋市立山王小学校",10,"小学校",1]
["前橋市立わかば小学校",11,"小学校",1]
["前橋市立上川淵小学校",12,"小学校",1]
["前橋市立下川淵小学校",13,"小学校",1]
["前橋市立桂萱小学校",14,"小学校",1]
["前橋市立桃木小学校",15,"小学校",1]
["前橋市立桂萱東小学校",16,"小学校",1]
["前橋市立桃瀬小学校",17,"小学校",1]
["前橋市立芳賀小学校",18,"小学校",1]
["前橋市立総社小学校",19,"小学校",1]
["前橋市立勝山小学校",20,"小学校",1]
["前橋市立元総社小学校",21,"小学校",1]
["前橋市立元総社南小学校",22,"小学校",1]
["前橋市立元総社北小学校",23,"小学校",1]
["前橋市立東小学校",24,"小学校",1]
["前橋市立大利根小学校",25,"小学校",1]
["前橋市立新田小学校",26,"小学校",1]
["前橋市立細井小学校",27,"小学校",1]
["前橋市立桃川小学校",28,"小学校",1]
["前橋市立荒牧小学校",29,"小学校",1]
["前橋市立荒牧小学校みやま分校",30,"小学校",1]
["前橋市立清里小学校",31,"小学校",1]
["前橋市立永明小学校",32,"小学校",1]
["前橋市立駒形小学校",33,"小学校",1]
["前橋市立荒子小学校",34,"小学校",1]
["前橋市立大室小学校",35,"小学校",1]
["前橋市立二之宮小学校",36,"小学校",1]
["前橋市立笂井小学校",37,"小学校",1]
["前橋市立大胡小学校",38,"小学校",1]
["前橋市立大胡東小学校",39,"小学校",1]
["前橋市立滝窪小学校",40,"小学校",1]
["前橋市立滝窪小学校金丸分校",41,"小学校",1]
["前橋市立宮城小学校",42,"小学校",1]
["前橋市立粕川小学校",43,"小学校",1]
["前橋市立月田小学校",44,"小学校",1]
["前橋市立原小学校",45,"小学校",1]
["前橋市立時沢小学校",46,"小学校",1]
["前橋市立石井小学校",47,"小学校",1]
["前橋市立白川小学校",48,"小学校",1]
["高崎市立中央小学校",49,"小学校",1]
["高崎市立北小学校",50,"小学校",1]
["高崎市立南小学校",51,"小学校",1]
["高崎市立東小学校",52,"小学校",1]
["高崎市立西小学校",53,"小学校",1]
["高崎市立塚沢小学校",54,"小学校",1]
["高崎市立片岡小学校",55,"小学校",1]
["高崎市立寺尾小学校",56,"小学校",1]
["高崎市立佐野小学校",57,"小学校",1]
["高崎市立六郷小学校",58,"小学校",1]
["高崎市立城南小学校",59,"小学校",1]
["高崎市立城東小学校",60,"小学校",1]
["高崎市立新高尾小学校",61,"小学校",1]
["高崎市立中川小学校",62,"小学校",1]
["高崎市立八幡小学校",63,"小学校",1]
["高崎市立豊岡小学校",64,"小学校",1]
["高崎市立長野小学校",65,"小学校",1]
["高崎市立大類小学校",66,"小学校",1]
["高崎市立南八幡小学校",67,"小学校",1]
["高崎市立倉賀野小学校",68,"小学校",1]
["高崎市立岩鼻小学校",69,"小学校",1]
["高崎市立京ヶ島小学校",70,"小学校",1]
["高崎市立滝川小学校",71,"小学校",1]
["高崎市立東部小学校",72,"小学校",1]
["高崎市立中居小学校",73,"小学校",1]
["高崎市立北部小学校",74,"小学校",1]
["高崎市立西部小学校",75,"小学校",1]
["高崎市立乗附小学校",76,"小学校",1]
["高崎市立浜尻小学校",77,"小学校",1]
["高崎市立矢中小学校",78,"小学校",1]
["高崎市立城山小学校",79,"小学校",1]
["高崎市立鼻高小学校",80,"小学校",1]
["高崎市立倉渕小学校",81,"小学校",1]
["高崎市立箕輪小学校",82,"小学校",1]
["高崎市立車郷小学校",83,"小学校",1]
["高崎市立箕郷東小学校",84,"小学校",1]
["高崎市立金古小学校",85,"小学校",1]
["高崎市立国府小学校",86,"小学校",1]
["高崎市立堤ヶ岡小学校",87,"小学校",1]
["高崎市立上郊小学校",88,"小学校",1]
["高崎市立金古南小学校",89,"小学校",1]
["高崎市立桜山小学校",90,"小学校",1]
["高崎市立新町第一小学校",91,"小学校",1]
["高崎市立新町第二小学校",92,"小学校",1]
["高崎市立下室田小学校",93,"小学校",1]
["高崎市立中室田小学校",94,"小学校",1]
["高崎市立上室田小学校",95,"小学校",1]
["高崎市立里見小学校",96,"小学校",1]
["高崎市立久留馬小学校",97,"小学校",1]
["高崎市立下里見小学校",98,"小学校",1]
["高崎市立宮沢小学校",99,"小学校",1]
["高崎市立吉井小学校",100,"小学校",1]
["高崎市立吉井西小学校",101,"小学校",1]
["高崎市立多胡小学校",102,"小学校",1]
["高崎市立入野小学校",103,"小学校",1]
["高崎市立馬庭小学校",104,"小学校",1]
["高崎市立南陽台小学校",105,"小学校",1]
["高崎市立岩平小学校",106,"小学校",1]
["桐生市立東小学校",107,"小学校",1]
["桐生市立西小学校",108,"小学校",1]
["桐生市立南小学校",109,"小学校",1]
["桐生市立北小学校",110,"小学校",1]
["桐生市立境野小学校",111,"小学校",1]
["桐生市立広沢小学校",112,"小学校",1]
["桐生市立梅田南小学校",113,"小学校",1]
["桐生市立相生小学校",114,"小学校",1]
["桐生市立川内小学校",115,"小学校",1]
["桐生市立桜木小学校",116,"小学校",1]
["桐生市立菱小学校",117,"小学校",1]
["桐生市立天沼小学校",118,"小学校",1]
["桐生市立神明小学校",119,"小学校",1]
["桐生市立新里中央小学校",120,"小学校",1]
["桐生市立新里東小学校",121,"小学校",1]
["桐生市立新里北小学校",122,"小学校",1]
["伊勢崎市立北小学校",124,"小学校",1]
["伊勢崎市立南小学校",125,"小学校",1]
["伊勢崎市立殖蓮小学校",126,"小学校",1]
["伊勢崎市立茂呂小学校",127,"小学校",1]
["伊勢崎市立三郷小学校",128,"小学校",1]
["伊勢崎市立宮郷小学校",129,"小学校",1]
["伊勢崎市立名和小学校",130,"小学校",1]
["伊勢崎市立豊受小学校",131,"小学校",1]
["伊勢崎市立北第二小学校",132,"小学校",1]
["伊勢崎市立殖蓮第二小学校",133,"小学校",1]
["伊勢崎市立広瀬小学校",134,"小学校",1]
["伊勢崎市立坂東小学校",135,"小学校",1]
["伊勢崎市立宮郷第二小学校",136,"小学校",1]
["伊勢崎市立赤堀小学校",137,"小学校",1]
["伊勢崎市立赤堀南小学校",138,"小学校",1]
["伊勢崎市立赤堀東小学校",139,"小学校",1]
["伊勢崎市立あずま小学校",140,"小学校",1]
["伊勢崎市立あずま南小学校",141,"小学校",1]
["伊勢崎市立あずま北小学校",142,"小学校",1]
["伊勢崎市立境小学校",143,"小学校",1]
["伊勢崎市立境采女小学校",144,"小学校",1]
["伊勢崎市立境剛志小学校",145,"小学校",1]
["伊勢崎市立境東小学校",146,"小学校",1]
["太田市立太田小学校",147,"小学校",1]
["太田市立九合小学校",148,"小学校",1]
["太田市立沢野小学校",149,"小学校",1]
["太田市立韮川小学校",150,"小学校",1]
["太田市立鳥之郷小学校",151,"小学校",1]
["太田市立南小学校",153,"小学校",1]
["太田市立休泊小学校",154,"小学校",1]
["太田市立強戸小学校",155,"小学校",1]
["太田市立宝泉小学校",156,"小学校",1]
["太田市立宝泉南小学校",157,"小学校",1]
["太田市立毛里田小学校",158,"小学校",1]
["太田市立中央小学校",159,"小学校",1]
["太田市立宝泉東小学校",160,"小学校",1]
["太田市立旭小学校",162,"小学校",1]
["太田市立駒形小学校",163,"小学校",1]
["太田市立城西小学校",164,"小学校",1]
["太田市立沢野中央小学校",165,"小学校",1]
["太田市立尾島小学校",166,"小学校",1]
["太田市立世良田小学校",167,"小学校",1]
["太田市立木崎小学校",168,"小学校",1]
["太田市立生品小学校",169,"小学校",1]
["太田市立綿打小学校",170,"小学校",1]
["太田市立藪塚本町小学校",171,"小学校",1]
["太田市立藪塚本町南小学校",172,"小学校",1]
["沼田市立沼田小学校",173,"小学校",1]
["沼田市立沼田東小学校",174,"小学校",1]
["沼田市立沼田北小学校",175,"小学校",1]
["沼田市立升形小学校",176,"小学校",1]
["沼田市立利南東小学校",177,"小学校",1]
["沼田市立池田小学校",178,"小学校",1]
["沼田市立薄根小学校",179,"小学校",1]
["沼田市立川田小学校",180,"小学校",1]
["沼田市立白沢小学校",181,"小学校",1]
["沼田市立利根小学校",182,"小学校",1]
[]
["館林市立第一小学校",184,"小学校",1]
["館林市立第二小学校",185,"小学校",1]
["館林市立第三小学校",186,"小学校",1]
["館林市立第四小学校",187,"小学校",1]
["館林市立第五小学校",188,"小学校",1]
["館林市立第六小学校",189,"小学校",1]
["館林市立第七小学校",190,"小学校",1]
["館林市立第八小学校",191,"小学校",1]
["館林市立第九小学校",192,"小学校",1]
["館林市立第十小学校",193,"小学校",1]
["館林市立美園小学校",194,"小学校",1]
["渋川市立渋川北小学校",195,"小学校",1]
["渋川市立渋川南小学校",196,"小学校",1]
["渋川市立金島小学校",197,"小学校",1]
["渋川市立古巻小学校",198,"小学校",1]
["渋川市立豊秋小学校",199,"小学校",1]
["渋川市立渋川西小学校",200,"小学校",1]
["渋川市立伊香保小学校",201,"小学校",1]
["渋川市立小野上小学校",202,"小学校",1]
["渋川市立中郷小学校",203,"小学校",1]
["渋川市立長尾小学校",204,"小学校",1]
["渋川市立三原田小学校",205,"小学校",1]
["渋川市立津久田小学校",206,"小学校",1]
["渋川市立橘小学校",207,"小学校",1]
["渋川市立橘北小学校",208,"小学校",1]
["藤岡市立藤岡第一小学校",209,"小学校",1]
["藤岡市立藤岡第二小学校",210,"小学校",1]
["藤岡市立神流小学校",211,"小学校",1]
["藤岡市立小野小学校",212,"小学校",1]
["藤岡市立美土里小学校",213,"小学校",1]
["藤岡市立美九里東小学校",214,"小学校",1]
["藤岡市立美九里西小学校",215,"小学校",1]
["藤岡市立平井小学校",216,"小学校",1]
[]
["藤岡市立鬼石北小学校",218,"小学校",1]
["藤岡市立鬼石小学校",219,"小学校",1]
["富岡市立富岡小学校",220,"小学校",1]
["富岡市立西小学校",221,"小学校",1]
["富岡市立黒岩小学校",222,"小学校",1]
[]
["富岡市立高瀬小学校",224,"小学校",1]
["富岡市立額部小学校",225,"小学校",1]
["富岡市立小野小学校",226,"小学校",1]
[]
[]
["富岡市立高田小学校",229,"小学校",1]
["富岡市立妙義小学校",230,"小学校",1]
["安中市立安中小学校",231,"小学校",1]
["安中市立原市小学校",232,"小学校",1]
["安中市立磯部小学校",233,"小学校",1]
["安中市立東横野小学校",234,"小学校",1]
["安中市立碓東小学校",235,"小学校",1]
["安中市立秋間小学校",236,"小学校",1]
[]
["安中市立松井田小学校",238,"小学校",1]
["安中市立西横野小学校",240,"小学校",1]
[]
["みどり市立笠懸小学校",242,"小学校",1]
["みどり市立笠懸東小学校",243,"小学校",1]
["みどり市立笠懸北小学校",244,"小学校",1]
["みどり市立笠懸西小学校",245,"小学校",1]
["みどり市立大間々北小学校",246,"小学校",1]
["みどり市立大間々南小学校",247,"小学校",1]
["みどり市立大間々東小学校",248,"小学校",1]
["榛東村立北小学校",251,"小学校",1]
["榛東村立南小学校",252,"小学校",1]
["吉岡町立明治小学校",253,"小学校",1]
["吉岡町立駒寄小学校",254,"小学校",1]
["上野村立上野小学校",255,"小学校",1]
["神流町立万場小学校",256,"小学校",1]
["下仁田町立下仁田小学校",257,"小学校",1]
["甘楽町立小幡小学校",259,"小学校",1]
["甘楽町立福島小学校",260,"小学校",1]
["甘楽町立新屋小学校",261,"小学校",1]
["中之条町立中之条小学校",262,"小学校",1]
["中之条町立六合小学校",263,"小学校",1]
["長野原町立中央小学校",264,"小学校",1]
["長野原町立浅間小学校",265,"小学校",1]
["嬬恋村立東部小学校",268,"小学校",1]
["嬬恋村立西部小学校",269,"小学校",1]
["草津町立草津小学校",270,"小学校",1]
["高山村立高山小学校",271,"小学校",1]
["東吾妻町立東小学校",272,"小学校",1]
["東吾妻町立太田小学校",273,"小学校",1]
["東吾妻町立原町小学校",274,"小学校",1]
["東吾妻町立岩島小学校",275,"小学校",1]
["東吾妻町立坂上小学校",276,"小学校",1]
["片品村立片品小学校",277,"小学校",1]
[]
["昭和村立東小学校",279,"小学校",1]
["昭和村立南小学校",280,"小学校",1]
["昭和村立大河原小学校",281,"小学校",1]
[]
[]
[]
["みなかみ町立水上小学校",285,"小学校",1]
["みなかみ町立藤原小学校",286,"小学校",1]
["みなかみ町立新治小学校",287,"小学校",1]
["玉村町立玉村小学校",288,"小学校",1]
["玉村町立上陽小学校",289,"小学校",1]
["玉村町立芝根小学校",290,"小学校",1]
["玉村町立中央小学校",291,"小学校",1]
["玉村町立南小学校",292,"小学校",1]
["板倉町立東小学校",293,"小学校",1]
["板倉町立西小学校",294,"小学校",1]
["明和町立明和東小学校",297,"小学校",1]
["明和町立明和西小学校",298,"小学校",1]
["千代田町立西小学校",299,"小学校",1]
["千代田町立東小学校",300,"小学校",1]
["大泉町立南小学校",301,"小学校",1]
["大泉町立北小学校",302,"小学校",1]
["大泉町立西小学校",303,"小学校",1]
["大泉町立東小学校",304,"小学校",1]
["邑楽町立中野小学校",305,"小学校",1]
["邑楽町立高島小学校",306,"小学校",1]
["邑楽町立長柄小学校",307,"小学校",1]
["邑楽町立中野東小学校",308,"小学校",1]
["群馬大学共同教育学部附属小学校",309,"小学校",1]
["フェリーチェ玉村国際小学校",311,"小学校",1]
["前橋市立第一中学校",1001,"中学校",2]
["前橋市立みずき中学校",1002,"中学校",2]
["前橋市立第三中学校",1003,"中学校",2]
["前橋市立第五中学校",1004,"中学校",2]
["前橋市立第六中学校",1005,"中学校",2]
["前橋市立第七中学校",1006,"中学校",2]
["前橋市立明桜中学校",1007,"中学校",2]
["前橋市立桂萱中学校",1009,"中学校",2]
["前橋市立芳賀中学校",1010,"中学校",2]
["前橋市立元総社中学校",1011,"中学校",2]
["前橋市立東中学校",1012,"中学校",2]
["前橋市立箱田中学校",1013,"中学校",2]
["前橋市立南橘中学校",1014,"中学校",2]
["前橋市立南橘中学校みやま分校",1015,"中学校",2]
["前橋市立鎌倉中学校",1016,"中学校",2]
["前橋市立木瀬中学校",1017,"中学校",2]
["前橋市立荒砥中学校",1018,"中学校",2]
["前橋市立大胡中学校",1019,"中学校",2]
["前橋市立宮城中学校",1020,"中学校",2]
["前橋市立粕川中学校",1021,"中学校",2]
["前橋市立富士見中学校",1022,"中学校",2]
["高崎市立第一中学校",1023,"中学校",2]
["高崎市立高松中学校",1024,"中学校",2]
["高崎市立並榎中学校",1025,"中学校",2]
["高崎市立豊岡中学校",1026,"中学校",2]
["高崎市立中尾中学校",1027,"中学校",2]
["高崎市立長野郷中学校",1028,"中学校",2]
["高崎市立大類中学校",1029,"中学校",2]
["高崎市立塚沢中学校",1030,"中学校",2]
["高崎市立片岡中学校",1031,"中学校",2]
["高崎市立佐野中学校",1032,"中学校",2]
["高崎市立南八幡中学校",1033,"中学校",2]
["高崎市立倉賀野中学校",1034,"中学校",2]
["高崎市立高南中学校",1035,"中学校",2]
["高崎市立寺尾中学校",1036,"中学校",2]
["高崎市立八幡中学校",1037,"中学校",2]
["高崎市立矢中中学校",1038,"中学校",2]
["高崎市立倉渕中学校",1039,"中学校",2]
["高崎市立箕郷中学校",1040,"中学校",2]
["高崎市立群馬中央中学校",1041,"中学校",2]
["高崎市立群馬南中学校",1042,"中学校",2]
["高崎市立新町中学校",1043,"中学校",2]
["高崎市立榛名中学校",1044,"中学校",2]
["高崎市立吉井中央中学校",1045,"中学校",2]
["高崎市立吉井西中学校",1046,"中学校",2]
["高崎市立入野中学校",1047,"中学校",2]
["桐生市立中央中学校",1048,"中学校",2]
["桐生市立清流中学校",1049,"中学校",2]
["桐生市立境野中学校",1050,"中学校",2]
["桐生市立広沢中学校",1051,"中学校",2]
["桐生市立梅田中学校",1052,"中学校",2]
["桐生市立相生中学校",1053,"中学校",2]
["桐生市立川内中学校",1054,"中学校",2]
["桐生市立桜木中学校",1055,"中学校",2]
["桐生市立新里中学校",1056,"中学校",2]
["伊勢崎市立第一中学校",1058,"中学校",2]
["伊勢崎市立第二中学校",1059,"中学校",2]
["伊勢崎市立第三中学校",1060,"中学校",2]
["伊勢崎市立第四中学校",1061,"中学校",2]
["伊勢崎市立殖蓮中学校",1062,"中学校",2]
["伊勢崎市立宮郷中学校",1063,"中学校",2]
["伊勢崎市立赤堀中学校",1064,"中学校",2]
["伊勢崎市立あずま中学校",1065,"中学校",2]
["伊勢崎市立境北中学校",1066,"中学校",2]
["伊勢崎市立境西中学校",1067,"中学校",2]
["伊勢崎市立境南中学校",1068,"中学校",2]
["太田市立西中学校",1069,"中学校",2]
["太田市立東中学校",1071,"中学校",2]
["太田市立南中学校",1072,"中学校",2]
["太田市立休泊中学校",1073,"中学校",2]
["太田市立強戸中学校",1074,"中学校",2]
["太田市立宝泉中学校",1075,"中学校",2]
["太田市立毛里田中学校",1076,"中学校",2]
["太田市立城西中学校",1077,"中学校",2]
["太田市立城東中学校",1078,"中学校",2]
["太田市立旭中学校",1079,"中学校",2]
["太田市立尾島中学校",1080,"中学校",2]
["太田市立木崎中学校",1081,"中学校",2]
["太田市立生品中学校",1082,"中学校",2]
["太田市立綿打中学校",1083,"中学校",2]
["太田市立薮塚本町中学校",1084,"中学校",2]
["太田市立太田中学校",1085,"中学校",2]
["沼田市立沼田中学校",1086,"中学校",2]
["沼田市立沼田南中学校",1087,"中学校",2]
["沼田市立沼田西中学校",1088,"中学校",2]
["沼田市立沼田東中学校",1089,"中学校",2]
["沼田市立池田中学校",1090,"中学校",2]
["沼田市立薄根中学校",1091,"中学校",2]
["沼田市立白沢中学校",1092,"中学校",2]
["沼田市立利根中学校",1093,"中学校",2]
[]
["館林市立第一中学校",1095,"中学校",2]
["館林市立第二中学校",1096,"中学校",2]
["館林市立第三中学校",1097,"中学校",2]
["館林市立第四中学校",1098,"中学校",2]
["館林市立多々良中学校",1099,"中学校",2]
["渋川市立渋川中学校",1100,"中学校",2]
["渋川市立渋川北中学校",1101,"中学校",2]
["渋川市立金島中学校",1102,"中学校",2]
["渋川市立古巻中学校",1103,"中学校",2]
["渋川市立伊香保中学校",1104,"中学校",2]
{"$rows_left_out":178}
{"sheet":"加盟形態","index":4,"n_rows":8,"n_cols":2,"rows_kept":8,"cut":false,"hidden":false,"merged":[]}
["加盟形態","番号"]
["全校",1]
["学年",2]
["学級",3]
["児童生徒会",4]
["委員会",5]
["部活動",6]
["その他",99]

{"sheet":"エラーチェック","index":5,"n_rows":22,"n_cols":16,"rows_kept":22,"cut":false,"hidden":false,"merged":[[3,15,4,15],[3,7,4,7],[14,0,14,1],[21,0,21,1],[3,13,3,14],[3,12,4,12],[3,8,3,9],[3,10,4,10],[3,6,4,6],[20,0,20,1],[4,0,4,1],[7,0,7,1],[15,0,15,1],[1,6,1,8],[17,0,17,2],[18,0,18,1],[19,0,19,1],[2,6,2,7],[5,0,5,1],[6,0,6,1],[9,0,9,1],[8,0,8,1],[1,0,1,2],[2,0,2,1],[3,0,3,1]]}
[]
["加盟校情報",null,null,null,null,null,"メンバー数"]
["シート名",null,"登録内容",null,null,null,"シート名",null,"メンバー数"]
["学校名",null,"D3",null,null,null,"学年","加盟学級数、又は委員会、部活数","メンバー数",null,"指導者数",null,"全校学級数","全校児童・生徒数",null,"全教員数"]
["学校区分コード",null,"K4",null,null,null,null,null,"男","女",null,null,null,"男","女"]
["電話",null,"D5",null,null,null,"小1\n(義務1)","B11","D11","E11","H11",null,"J11","M11","N11","Q11"]
["FAX",null,"D6",null,null,null,"小2\n(義務2)","B12","D12","E12","H12"]
["代表メールアドレス",null,"D7",null,null,null,"小3\n(義務3)","B13","D13","E13","H13"]
["担当教諭メールアドレス",null,"D8",null,null,null,"小4\n(義務4)","B14","D14","E14","H14"]
["郵便番号",null,"E9",null,null,null,"小5\n(義務5)","B15","D15","E15","H15"]
["住所１",null,"D10",null,null,null,"小6\n(義務6)","B16","D16","E16","H16"]
["住所２",null,"F10",null,null,null,"特別支援学級","B17","D17","E17","H17"]
["学校長名",null,"D11",null,null,null,"中1\n(義務7)(中等1)","B18","D18","E18","H18"]
["指導主任教諭",null,"D12",null,null,null,"中2\n(義務8)(中等2)","B19","D19","E19","H19"]
["加盟形態",null,"D13",null,null,null,"中3\n(義務9)(中等3)","B20","D20","E20","H20"]
["登録申込日",null,"D15",null,null,null,"特別支援学級\n(義務特別支援学校)","B21","D21","E21","H21"]
[null,null,null,null,null,null,"高1\n(中等4)","B22","D22","E22","H22"]
["アンケート",null,null,null,null,null,"高2\n(中等5)","B23","D23","E23","H23"]
["シート名",null,"活動報告ｱﾝｹｰﾄ",null,null,null,"高3\n(中等6)","B24","D24","E24","H24"]
["その他有無",null,"C52",null,null,null,"高4","B25","D25","E25","H25"]
["その他内容",null,"D52"]
["アンケート選択カウント",null,"I6"]